{"text_format":"1","workbook":"xlsx","n_sheets":2,"sheets":["申込","学校一覧"],"not_rendered":{"charts":0,"images":0,"macros":0,"external_links":0,"defined_names":3,"comments":0,"pivot_tables":0},"unopened":[],"bounds":{"document_bytes":16777216,"sheet_cells":100000,"rows_first":2000,"rows_last":500,"rows_between":2000,"halvings":0,"cell_chars":16384,"cell_head_chars":4096},"cells_cut":0,"cells_raw":0,"read":"whole","date_system":"1900"}

{"sheet":"申込","index":0,"n_rows":34,"n_cols":25,"rows_kept":34,"cut":false,"hidden":false,"merged":[[0,17,0,19],[1,0,1,19],[3,2,3,3],[3,5,3,15],[2,2,2,3],[9,0,9,1],[7,0,7,1],[8,0,8,1],[6,12,6,13],[6,14,6,19],[13,1,13,4],[13,5,13,9],[13,10,13,13],[13,14,13,15],[13,16,13,17],[13,18,13,19],[7,10,7,11],[10,0,10,1],[10,2,10,7],[8,10,8,11],[9,10,9,11],[9,18,9,19],[8,18,8,19],[8,12,8,17],[9,12,9,17],[11,1,11,19],[14,1,14,4],[14,5,14,9],[14,10,14,13],[14,14,14,15],[14,16,14,17],[14,18,14,19],[15,1,15,4],[15,5,15,9],[15,10,15,13],[15,14,15,15],[15,16,15,17],[15,18,15,19],[16,1,16,4],[16,5,16,9],[16,10,16,13],[16,14,16,15],[16,16,16,17],[16,18,16,19],[17,1,17,4],[17,5,17,9],[17,10,17,13],[17,14,17,15],[17,16,17,17],[17,18,17,19],[18,1,18,4],[18,5,18,9],[18,10,18,13],[18,14,18,15],[18,16,18,17],[18,18,18,19],[19,1,19,4],[19,5,19,9],[19,10,19,13],[19,14,19,15],[19,16,19,17],[19,18,19,19],[20,1,20,4],[20,5,20,9],[20,10,20,13],[20,14,20,15],[20,16,20,17],[20,18,20,19],[21,1,21,4],[21,5,21,9],[21,10,21,13],[21,14,21,15],[21,16,21,17],[21,18,21,19],[22,1,22,4],[22,5,22,9],[22,10,22,13],[22,14,22,15],[22,16,22,17],[22,18,22,19],[23,1,23,4],[23,5,23,9],[23,10,23,13],[23,14,23,15],[23,16,23,17],[23,18,23,19],[26,1,26,4],[26,5,26,9],[26,10,26,13],[26,14,26,15],[26,16,26,17],[26,18,26,19],[27,1,27,4],[27,5,27,9],[27,10,27,13],[27,14,27,15],[27,16,27,17],[27,18,27,19],[28,0,28,19],[29,0,29,19],[31,0,31,6],[33,3,33,11],[33,12,33,16],[3,0,3,1],[2,0,2,1],[5,12,5,19],[5,0,6,1],[12,14,12,15],[12,18,12,19],[7,2,7,9],[7,12,7,19],[5,2,6,9],[5,10,6,11],[8,2,8,7],[8,8,8,9],[9,2,9,7],[10,10,10,11],[10,12,10,17],[12,1,12,4],[12,5,12,9],[12,10,12,13],[12,16,12,17],[24,1,24,4],[24,5,24,9],[24,10,24,13],[24,14,24,15],[24,16,24,17],[24,18,24,19],[25,1,25,4],[25,5,25,9],[25,10,25,13],[25,14,25,15],[25,16,25,17],[25,18,25,19]]}
["令和8年度",null,null,null,null,null,null,null,null,null,null,null,null,null,null,null,null,"１枚目",null,null,null,"男子","職員","職員","長"]
["沖縄県高等学校総合体育大会",null,null,null,null,null,null,null,null,null,null,null,null,null,null,null,null,null,null,null,null,"女子","外部","生徒"]
["学校番号"]
[null,null,null,null,null,"バスケットボール競技　申込書"]
[]
["学 校 名",null,{"$f":"IF(A4=\"\",\"\",VLOOKUP($A$4,学校一覧!$A$2:$I$79,9)&VLOOKUP($A$4,学校一覧!$A$2:$I$79,2))","v":""},null,null,null,null,null,null,null,"所在地",null,{"$f":"IF(A4=\"\",\"\",VLOOKUP($A$4,学校一覧!$A$2:$I$79,5))","v":""}]
[null,null,null,null,null,null,null,null,null,null,null,null,"TEL",null,{"$f":"IF(A4=\"\",\"\",VLOOKUP($A$4,学校一覧!$A$2:$I$79,6))","v":""}]
["チームID",null,null,null,null,null,null,null,null,null,"引率責任者"]
["コ ー チ",null,null,null,null,null,null,null,null,null,"アシスタントコーチ"]
["メンバーID",null,null,null,null,null,null,null,null,"級","マネージャー"]
["帯同\n審判①",null,null,null,null,null,null,null,null,"級","帯同\n審判②",null,null,null,null,null,null,null,null,"級"]
[]
["背番号","競技者登録番号",null,null,null,"選手名",null,null,null,null,"生年月日",null,null,null,"学年",null,"身長",null,"出身中"]
[]
[]
[]
[]
[]
[]
[]
[]
[]
[]
[]
[]
[]
[]
[]
["①上記の者は本校在学生であり、健康診断の結果異常なく標記大会に出場することを認め参加申し込みいたします。"]
["②個人情報については「沖縄県高体連個人情報保護方針」を承諾した上で参加申込みすることに同意します。"]
[]
["　　　令和８年　　月　　　日"]
[]
[null,null,"　　　　　　　　　　　　　　　　　　　高等学校長　　　　　　　　　　　　　　印",{"$f":"IF(A4=\"\",\"\",$C$6&$Y$1)","v":""},null,null,null,null,null,null,null,null,null,null,null,null,null,"印"]

{"sheet":"学校一覧","index":1,"n_rows":80,"n_cols":9,"rows_kept":80,"cut":false,"hidden":false,"merged":[]}
["学校番号","学校名","学校略称名","〒","所在地","電話番号","FAX番号","e-mail","県立・私立"]
[1,"辺土名高等学校","辺土名","905-1304","大宜味村字饒波2015","0980-44-3103","0980-44-3951","xx330019@pref.okinawa.lg.jp","沖縄県立"]
[2,"北山高等学校","北山","905-0424","今帰仁村字仲尾次540-1","0980-56-2401","0980-56-3726","xx330027@pref.okinawa.lg.jp","沖縄県立"]
[3,"本部高等学校","本部","905-0214","本部町字渡久地377","0980-47-2418","0980-47-2439","xx330035@pref.okinawa.lg.jp","沖縄県立"]
[4,"名護商工高等学校","名商工","905-0019","名護市大北4-1-23","0980-52-3278","0980-52-1489","xx331040@pref.okinawa.lg.jp","沖縄県立"]
[5,"名護高等学校","名護","905-0018","名護市大西5-17-1","0980-52-2615","0980-54-1557","xx330043@pref.okinawa.lg.jp","沖縄県立"]
[6,"北部農林高等学校","北農","905-0006","名護市字宇茂佐13","0980-52-2634","0980-52-1664","xx330418@pref.okinawa.lg.jp","沖縄県立"]
[7,"沖縄高等専門学校","沖縄高専","905-2171","沖縄県名護市辺野古905","0980-55-4003","0980-55-4012","ssoumu＠okinawa-ct.ac.jp","国立"]
[8,"宜野座高等学校","宜野座","904-1302","宜野座村字宜野座1","098-968-8311","098-968-4709","xx330051@pref.okinawa.lg.jp","沖縄県立"]
[9,"石川高等学校","石川","904-1115","うるま市石川伊波861","098-964-2006","098-964-4092","xx330060@pref.okinawa.lg.jp","沖縄県立"]
[10,"具志川商業高等学校","具商","904-2215","うるま市みどり町6-10-1","098-972-3287","098-972-7579","xx330647@pref.okinawa.lg.jp","沖縄県立"]
[11,"前原高等学校","前原","904-2213","うるま市字田場1827","098-973-3249","098-973-4951","xx330019@pref.okinawa.lg.jp","沖縄県立"]
[12,"中部農林高等学校","中農","904-2213","うるま市字田場1570","098-973-3578","098-973-3357","xx330027@pref.okinawa.lg.jp","沖縄県立"]
[13,"具志川高等学校","具志川","904-2236","うるま市喜仲3-28-1","098-973-1213","098-973-8441","xx330035@pref.okinawa.lg.jp","沖縄県立"]
[14,"与勝高等学校","与勝","904-2312","うるま市勝連平安名3248","098-978-5230","098-978-8346","xx331040@pref.okinawa.lg.jp","沖縄県立"]
[15,"読谷高等学校","読谷","904-0303","読谷村字伊良皆198","098-956-2157","098-956-3630","xx330043@pref.okinawa.lg.jp","沖縄県立"]
[16,"嘉手納高等学校","嘉手納","904-0202","嘉手納町字屋良806","098-956-3336","098-956-3798","xx330418@pref.okinawa.lg.jp","沖縄県立"]
[17,"美里高等学校","美里","904-2151","沖縄市松本2-5-1","098-938-5145","098-938-5419","ssoumu＠okinawa-ct.ac.jp","沖縄県立"]
[18,"美来工科高等学校","美来工科","904-0001","沖縄市越来3-17-1","098-937-5451","098-937-0346","xx330051@pref.okinawa.lg.jp","沖縄県立"]
[19,"コザ高等学校","コザ","904-0011","沖縄市照屋5-5-1","098-937-3563","098-937-0677","xx330060@pref.okinawa.lg.jp","沖縄県立"]
[20,"美里工業高等学校","美工","904-2172","沖縄市泡瀬5-42-2","098-937-5848","098-937-0842","xx330647@pref.okinawa.lg.jp","沖縄県立"]
[21,"球陽高等学校","球陽","904-0035","沖縄市南桃原1-10-1","098-933-9301","098-933-6212","xx330744@pref.okinawa.lg.jp","沖縄県立"]
[22,"北谷高等学校","北谷","904-0103","北谷町字桑江414","098-936-1010","098-936-1426","xx330205@pref.okinawa.lg.jp","沖縄県立"]
[23,"北中城高等学校","北中城","901-2302","北中城村字渡口1997-13","098-935-3377","098-935-5071","xx330281@pref.okinawa.lg.jp","沖縄県立"]
[24,"普天間高等学校","普天間","901-2202","宜野湾市普天間1-24-1","098-892-3354","098-892-5888","xx330108@pref.okinawa.lg.jp","沖縄県立"]
[25,"中部商業高等学校","中商","901-2214","宜野湾市我如古2-2-1","098-898-4888","098-898-4808","xx330604@pref.okinawa.lg.jp","沖縄県立"]
[26,"宜野湾高等学校","宜野湾","901-2224","宜野湾市真志喜2-25-1","098-897-1020","098-897-4031","xx330256@pref.okinawa.lg.jp","沖縄県立"]
[27,"沖縄カトリック高等学校","沖カト","901-2215","宜野湾市真栄原3-16-1","098-897-3300","098-897-3412","sfficial01@catholic-okinawa.ed.jp"]
[28,"西原高等学校","西原","903-0117","西原町字翁長610","098-945-5418","098-945-0339","xx330191@pref.okinawa.lg.jp","沖縄県立"]
[29,"浦添商業高等学校","浦商","901-2132","浦添市伊祖3-11-1","098-877-5844","098-877-4305","xx330639@pref.okinawa.lg.jp","沖縄県立"]
[30,"浦添工業高等学校","浦工","901-2111","浦添市経塚1-1-1","098-879-5992","098-879-4764","xx330574@pref.okinawa.lg.jp","沖縄県立"]
[31,"陽明高等学校","陽明","901-2113","浦添市字大平488","098-879-3062","098-879-9520","xx330230@pref.okinawa.lg.jp","沖縄県立"]
[32,"昭和薬科大学附属高等学校","昭薬附","901-2112","浦添市字沢岻450","098-870-1852","098-870-1853","sy-jimu@southernx.ne.jp"]
[33,"浦添高等学校","浦添","901-2121","浦添市内間3-26-1","098-877-4970","098-877-4219","xx330116@pref.okinawa.lg.jp","沖縄県立"]
[34,"那覇工業高等学校","那工","901-2122","浦添市勢理客4-22-1","098-877-6144","098-877-4883","xx330540@pref.okinawa.lg.jp","沖縄県立"]
[35,"那覇国際高等学校","那国際","900-0005","那覇市天久1-29-1","098-860-5931","098-860-3810","xx330329@pref.okinawa.lg.jp","沖縄県立"]
[36,"興南高等学校","興南","902-0061","那覇市古島1-7-1","098-884-3293","098-884-3228","soumu@konan-h.ed.jp"]
[37,"首里東高等学校","首里東","903-0804","那覇市首里石嶺町3-178","098-886-1578","098-886-5186","xx330302@pref.okinawa.lg.jp","沖縄県立"]
[38,"首里高等学校","首里","903-0816","那覇市首里真和志町2-43","098-885-0028","098-885-3442","xx330124@pref.okinawa.lg.jp","沖縄県立"]
[39,"沖縄工業高等学校","沖工","902-0062","那覇市松川3-20-1","098-832-3831","098-832-5029","xx330558@pref.okinawa.lg.jp","沖縄県立"]
[40,"沖縄尚学高等学校","沖尚","902-0075","那覇市字国場747","098-832-1767","098-832-2037","query@okisho.ed.jp"]
[41,"真和志高等学校","真和志","902-0072","那覇市字真地248","098-833-0810","098-833-5281","xx330141@pref.okinawa.lg.jp","沖縄県立"]
[42,"那覇商業高等学校","那商","900-0032","那覇市松山1-16-1","098-866-6555","098-866-3657","xx330612@pref.okinawa.lg.jp","沖縄県立"]
[43,"那覇高等学校","那覇","900-0014","那覇市松尾1-21-44","098-867-1623","098-867-7753","xx330132@pref.okinawa.lg.jp","沖縄県立"]
[44,"小禄高等学校","小禄","901-0151","那覇市鏡原町22-1","098-857-0481","098-857-5456","xx330159@pref.okinawa.lg.jp","沖縄県立"]
[45,"那覇西高等学校","那覇西","901-0155","那覇市金城3-5-1","098-858-8274","098-858-2938","xx330311@pref.okinawa.lg.jp","沖縄県立"]
[46,"開邦高等学校","開邦","901-1105","南風原町字新川646","098-889-1715","098-889-1709","xx330736@pref.okinawa.lg.jp","沖縄県立"]
[47,"南風原高等学校","南風原","901-1117","南風原町字津嘉山1140","098-889-4618","098-889-3667","xx330213@pref.okinawa.lg.jp","沖縄県立"]
[48,"知念高等学校","知念","901-1303","与那原町字与那原11","098-946-2207","098-946-6586","xx330175@pref.okinawa.lg.jp","沖縄県立"]
[49,"豊見城高等学校","豊見城","901-0201","豊見城市字真玉橋217","098-850-5551","098-850-5715","xx330167@pref.okinawa.lg.jp","沖縄県立"]
[50,"豊見城南高等学校","豊南","901-0223","豊見城市字翁長520","098-850-1950","098-850-9239","xx330264@pref.okinawa.lg.jp","沖縄県立"]
[51,"南部農林高等学校","南農","901-0203","豊見城市字長堂182","098-850-6006","098-850-1937","xx330434@pref.okinawa.lg.jp","沖縄県立"]
[52,"南部商業高等学校","南商","901-0411","八重瀬町字友寄850","098-998-2401","098-998-4697","xx330621@pref.okinawa.lg.jp","沖縄県立"]
[53,"南部工業高等学校","南工","901-0402","八重瀬町字富盛1338","098-998-2313","098-998-4761","xx330566@pref.okinawa.lg.jp","沖縄県立"]
[54,"向陽高等学校","向陽","901-0511","八重瀬町字港川150","098-998-9324","098-998-9326","xx330752@pref.okinawa.lg.jp","沖縄県立"]
[55,"沖縄水産高等学校","沖水","901-0305","糸満市西崎1-1-1","098-994-3483","098-994-5920","xx330710@pref.okinawa.lg.jp","沖縄県立"]
[56,"糸満高等学校","糸満","901-0361","糸満市字糸満1696-1","098-994-2012","098-994-2213","xx330183@pref.okinawa.lg.jp","沖縄県立"]
[57,"久米島高等学校","久米島","901-3121","久米島町字嘉手苅727","098-985-2233","098-985-3168","xx330817@pref.okinawa.lg.jp","沖縄県立"]
[58,"宮古高等学校","宮古","906-0012","宮古島市平良字西里718-1","0980-72-2118","0980-72-8209","xx330914@pref.okinawa.lg.jp","沖縄県立"]
[59,"宮古総合実業高等学校","宮古総実","906-0013","宮古島市平良字下里280","0980-72-2249","0980-72-1296","xx331050@pref.okinawa.lg.jp","沖縄県立"]
[60,"宮古工業高等学校","宮工","906-0007","宮古島市平良字東仲宗根968-4","0980-72-3185","0980-72-8041","xx330931@pref.okinawa.lg.jp","沖縄県立"]
[61,"八重山農林高等学校","八重山農","907-0022","石垣市字大川477-1","0980-82-3955","0980-82-3751","xx331023@pref.okinawa.lg.jp","沖縄県立"]
[62,"八重山商工高等学校","八商工","907-0002","石垣市字真栄里180","0980-82-3892","0980-82-1506","xx331031@pref.okinawa.lg.jp","沖縄県立"]
[63,"八重山高等学校","八重山","907-0004","石垣市字登野城275","0980-82-3972","0980-82-1065","xx331015@pref.okinawa.lg.jp","沖縄県立"]
[64,"鏡が丘特別支援学校","鏡が丘","901-2104","沖縄県浦添市当山３丁目２−７","098-877-4940","098-877-9958","xx350168@pref.okinawa.lg.jp","沖縄県立"]
[65,"沖縄高等特別支援学校","沖高特","904-2213","沖縄県うるま市田場１２４３","098-973-1661","098-974-1680","xx350320@pref.okinawa.lg.jp","沖縄県立"]
[66,"泊高等学校","泊","900-0012","那覇市泊3-19-2","098-868-1237","098-868-0618","xx340812@pref.okinawa.lg.jp","沖縄県立"]
[67,"星槎国際高等学校","星槎国","904-0032","沖縄市諸見里3‐7‐1","098－931-1003","098－931-1015"]
[68,"美咲特別支援学校","美咲特","904-2153","沖縄県沖縄市美里４丁目１８−１","098-938-1037","098-938-7700","xx350117@pref.okinawa.lg.jp","沖縄県立"]
[69,"KBC未来高等学校","未来","900-0034","那覇市東町23-1","098-863-0936","098-863-0938","hi@ida.ac.jp"]
[70,"宮古特別支援学校","宮古特","906-0002","沖縄県宮古島市平良狩俣４００５−１","0980-72-5117","0980-72-5320","xx350192@pref.okinawa.lg.jp","沖縄県立"]
[71,"西崎特別支援学校","西崎特","901-0305","沖縄県糸満市西崎1丁目1-2","098-994-6855","098-994-6856","xx350281@pref.okinawa.lg.jp","沖縄県立"]
[72,"大平特別支援学校","大平特","901-2113","浦添市大平1-27-1","098-877-4941","098-876-4148","xx350125@pref.okinawa.lg.jp","沖縄県立"]
[73,"日本ウェルネス高等学校","ウェルネス","901-2162","沖縄市開放1-22-13","098-901-7630",null,"okinawa@taiken.ac.jp"]
[74,"中部農林高等特別支援学校","中農高支","904-2213","沖縄県うるま市字田場1570","098-973-3578","098-973-3357","xx330426@pref.okinawa.lg.jp","沖縄県立"]
[75,"陽明高等特別支援学校","陽明高支","901-2113","沖縄県浦添市字大平488","098-870-1588","098-870-1589","xx330230@pref.okinawa.lg.jp","沖縄県立"]
[76,"南風原高等特別支援学校","南風原高支","901-1117","沖縄県島尻郡南風原町字津嘉山1140","098-889-4618","098-889-3667","xx330213@pref.okinawa.lg.jp","沖縄県立"]
[77,"やえせ高等特別支援学校","やえせ高支","901-0411","八重瀬町字友寄850","098-998-2401","098-998-4697","xx330621@pref.okinawa.lg.jp","沖縄県立"]
[78,"はなさき支援学校","はなさき支","901－2304","北中城村屋宜原415","098ｰ989ｰ0192","098ｰ989ｰ0193",null,"沖縄県立"]
[79,"鹿島朝日・沖縄","鹿島朝日","904-0013","沖縄市安慶田5‐1‐16　2F  ","098-923-0547","098-923-0548"]